{"text_format":"1","workbook":"xlsx","n_sheets":7,"sheets":["Instructions","Race NS","Race Spin","Boats","ScoreSheet","RSinput","Course"],"not_rendered":{"charts":0,"images":2,"macros":1,"external_links":0,"defined_names":6,"comments":0,"pivot_tables":0},"unopened":[],"bounds":{"document_bytes":16777216,"sheet_cells":100000,"rows_first":2000,"rows_last":500,"rows_between":2000,"halvings":0,"cell_chars":16384,"cell_head_chars":4096},"cells_cut":0,"cells_raw":0,"read":"whole","date_system":"1900"}

{"sheet":"Instructions","index":0,"n_rows":36,"n_cols":5,"rows_kept":36,"cut":false,"hidden":false,"merged":[[14,0,14,14],[0,0,0,14],[1,0,1,14],[2,0,2,14],[3,0,3,14],[4,0,4,14],[8,0,8,14],[9,0,9,14],[10,0,10,14],[11,0,11,14],[12,0,12,14],[13,0,13,14],[15,0,15,14],[16,0,16,14],[17,0,17,14],[18,0,18,14],[19,0,19,14]]}
["Instructions:  Frostbite racing worksheet"]
["ONLY Enter DATA In The SHADED Areas!!!!"]
["1. Select File - Save As, and Save with the \"File name\" as \"FB<Date>\", eg \"FB03Nov19\"."]
["2. Select the Committee Boat Name (use pulldown) and Enter the Race Date."]
["3. Enter the Course (ENTER THE START MARK).  Use the Pulldown List.  The Course Length is automatically calculated."]
[null,"The Start location is assumed to be \"Y\".  If the start location is moved then the distance must be manually calculated."]
[null,"If the course does not change for later starts, just leave the course selections blank for those starts.  "]
[null,"If later starts have a different course, enter the new course for each start that is different.  "]
["4. Enter each Yacht Name for the appropriate start.  Use the pulldown list.  The Sail Number and PHRF Rating is automatically   "]
["    completed.  If a Yacht Name is NOT in the pull down list, inquire about their race application and race fees. "]
["5. If the Start Time is different than the default, enter the New Start Time in 24-hour military format: (hr) (min) (sec)."]
["6. Save the File."]
["7. Enter the Finish Time for each boat in 24-hour military format: (hr) (min) (sec). "]
["     If a boat is DNS or DNF, leave the Finish Time as 23:00:00.  Enter the DNS or DNF in the Remarks column to the right of Corrected Time."]
["8. Save the File."]
["9. Select the Sort Fleet Button for each Class, located to the right of each Class's Remarks column."]
["10. Save the File."]
["11. Email the File to the Scorer at score@smsa.com"]
[]
["V 2019.FB.01   -  PHRF Boats as of  - 11/01/19"]
{"$rows_left_out":17}
{"sheet":"Race NS","index":1,"n_rows":28,"n_cols":20,"rows_kept":28,"cut":false,"hidden":false,"merged":[[10,4,10,6],[3,3,3,5],[2,3,2,7],[9,9,9,11],[10,9,10,11],[6,2,6,3],[7,2,7,3],[5,1,5,3],[7,4,7,5],[4,3,4,19],[9,14,9,18],[10,14,10,18]]}
[]
["   Race Name :  --->",null,null,"Frostbite Series - Fall # ",null,null,null,null,null,null,null,null,null,null,null,null,"Non Spin Class"]
["  Committee Boat Name -->  ",null,null,"Cheetah"]
[null," Date  -->",null,"2019-08-14"]
[null," Conditions --> (optional)",null,"GOOD"]
[null,"NonSpin Class - Start =    ",null,null,13,5,0]
[null,null,"  Course   =      ",null,"Y","K","V",null,null,"Y",null,null,null,null,"<--  Default start location is 'Y', when starting from shore - \"X\" if on RC Boat"]
[null,null,"  Distance  =   ",null,{"$f":"IF(ISBLANK(F7), 0, VLOOKUP(E7,Course!$A$23:$T$41, LOOKUP(F7,Course!$A$2:$A$19,Course!$B$2:$B$19),FALSE))+IF(ISBLANK(G7), 0, VLOOKUP(F7,Course!$A$23:$T$41, LOOKUP(G7,Course!$A$2:$A$19,Course!$B$2:$B$19),FALSE))+IF(ISBLANK(J7), 0, VLOOKUP(G7,Course!$A$23:$T$41, LOOKUP(J7,Course!$A$2:$A$19,Course!$B$2:$B$19),FALSE))+IF(ISBLANK(K7), 0, VLOOKUP(J7,Course!$A$23:$T$41, LOOKUP(K7,Course!$A$2:$A$19,Course!$B$2:$B$19),FALSE))+IF(ISBLANK(L7), 0, VLOOKUP(K7,Course!$A$23:$T$41, LOOKUP(L7,Course!$A$2:$A$19,Course!$B$2:$B$19),FALSE))+IF(ISBLANK(M7), 0, VLOOKUP(L7,Course!$A$23:$T$41, LOOKUP(M7,Course!$A$2:$A$19,Course!$B$2:$B$19),FALSE))","v":3.58},null,null,null,null,null,null,null,null,null,"<--  Override Distance for Windward/Leward courses"]
[null,null,"PHRF Type =  ",null,"NSWL"]
[null,null,null,null,null,null,null,null,null,"Uncorrected",null,null,null,"PHRF","Corrected"]
[null,"Sail","Yacht","PHRF","Finish Time",null,null,null,null,"Elapsed Time",null,null,null,"Allowance","Time",null,null,null,null,"Remarks"]
[null,"Number","Name","Rating","(hr)","(min)","(sec)",null,null,"(hr)","(min)","(sec)",null,"(Sec)","(Total Sec)",null,"(hr)","(min)","(sec)","(DNS/DNF)"]
[1,{"$f":"LOOKUP(C13, Boats!$A$3:B$53,Boats!B$3:B$53)&NSFLAG","v":{"$error":"#N/A"}},null,{"$f":"IF(E$9=\"NSWL\",LOOKUP(C13, Boats!$A$3:E$53,Boats!H$3:H$53),(IF(E$9=\"WL\",LOOKUP(C13, Boats!$A$3:E$53,Boats!F$3:F$53),(IF(E$9=\"NSCR\",LOOKUP(C13, Boats!$A$3:E$53,Boats!I$3:I$53))))))","v":{"$error":"#N/A"}},23,0,0,{"$f":"((E13*60*60+F13*60+G13)-(E$6*60*60+F$6*60+G$6))","v":35700},{"$f":"J13*60*60+K13*60","v":35700},{"$f":"ROUNDDOWN(H13/60/60, 0)","v":9},{"$f":"ROUNDDOWN((H13 - (J13*60*60))/60, 0)","v":55},{"$f":"H13-I13","v":0},null,{"$f":"D13*$E$8","v":{"$error":"#N/A"}},{"$f":"((J13*60+K13)*60+L13)-N13","v":{"$error":"#N/A"}},{"$f":"Q13*60*60+R13*60","v":{"$error":"#N/A"}},{"$f":"ROUNDDOWN(O13/60/60, 0)","v":{"$error":"#N/A"}},{"$f":"ROUNDDOWN((O13 - (Q13*60*60))/60, 0)","v":{"$error":"#N/A"}},{"$f":"O13-P13","v":{"$error":"#N/A"}}]
[2,{"$f":"LOOKUP(C14, Boats!$A$3:B$53,Boats!B$3:B$53)&NSFLAG","v":{"$error":"#N/A"}},null,{"$f":"IF(E$9=\"NSWL\",LOOKUP(C14, Boats!$A$3:E$53,Boats!H$3:H$53),(IF(E$9=\"WL\",LOOKUP(C14, Boats!$A$3:E$53,Boats!F$3:F$53),(IF(E$9=\"NSCR\",LOOKUP(C14, Boats!$A$3:E$53,Boats!I$3:I$53))))))","v":{"$error":"#N/A"}},23,0,0,35700,35700,9,55,0,null,{"$error":"#N/A"},{"$error":"#N/A"},{"$error":"#N/A"},{"$error":"#N/A"},{"$error":"#N/A"},{"$error":"#N/A"}]
[3,{"$f":"LOOKUP(C15, Boats!$A$3:B$53,Boats!B$3:B$53)&NSFLAG","v":{"$error":"#N/A"}},null,{"$f":"IF(E$9=\"NSWL\",LOOKUP(C15, Boats!$A$3:E$53,Boats!H$3:H$53),(IF(E$9=\"WL\",LOOKUP(C15, Boats!$A$3:E$53,Boats!F$3:F$53),(IF(E$9=\"NSCR\",LOOKUP(C15, Boats!$A$3:E$53,Boats!I$3:I$53))))))","v":{"$error":"#N/A"}},23,0,0,35700,35700,9,55,0,null,{"$error":"#N/A"},{"$error":"#N/A"},{"$error":"#N/A"},{"$error":"#N/A"},{"$error":"#N/A"},{"$error":"#N/A"}]
[4,{"$f":"LOOKUP(C16, Boats!$A$3:B$53,Boats!B$3:B$53)&NSFLAG","v":{"$error":"#N/A"}},null,{"$f":"IF(E$9=\"NSWL\",LOOKUP(C16, Boats!$A$3:E$53,Boats!H$3:H$53),(IF(E$9=\"WL\",LOOKUP(C16, Boats!$A$3:E$53,Boats!F$3:F$53),(IF(E$9=\"NSCR\",LOOKUP(C16, Boats!$A$3:E$53,Boats!I$3:I$53))))))","v":{"$error":"#N/A"}},23,0,0,35700,35700,9,55,0,null,{"$error":"#N/A"},{"$error":"#N/A"},{"$error":"#N/A"},{"$error":"#N/A"},{"$error":"#N/A"},{"$error":"#N/A"}]
[5,{"$f":"LOOKUP(C17, Boats!$A$3:B$53,Boats!B$3:B$53)&NSFLAG","v":{"$error":"#N/A"}},null,{"$f":"IF(E$9=\"NSWL\",LOOKUP(C17, Boats!$A$3:E$53,Boats!H$3:H$53),(IF(E$9=\"WL\",LOOKUP(C17, Boats!$A$3:E$53,Boats!F$3:F$53),(IF(E$9=\"NSCR\",LOOKUP(C17, Boats!$A$3:E$53,Boats!I$3:I$53))))))","v":{"$error":"#N/A"}},23,0,0,35700,35700,9,55,0,null,{"$error":"#N/A"},{"$error":"#N/A"},{"$error":"#N/A"},{"$error":"#N/A"},{"$error":"#N/A"},{"$error":"#N/A"}]
[6,{"$f":"LOOKUP(C18, Boats!$A$3:B$53,Boats!B$3:B$53)&NSFLAG","v":{"$error":"#N/A"}},null,{"$f":"IF(E$9=\"NSWL\",LOOKUP(C18, Boats!$A$3:E$53,Boats!H$3:H$53),(IF(E$9=\"WL\",LOOKUP(C18, Boats!$A$3:E$53,Boats!F$3:F$53),(IF(E$9=\"NSCR\",LOOKUP(C18, Boats!$A$3:E$53,Boats!I$3:I$53))))))","v":{"$error":"#N/A"}},23,0,0,35700,35700,9,55,0,null,{"$error":"#N/A"},{"$error":"#N/A"},{"$error":"#N/A"},{"$error":"#N/A"},{"$error":"#N/A"},{"$error":"#N/A"}]
[7,{"$f":"LOOKUP(C19, Boats!$A$3:B$53,Boats!B$3:B$53)&NSFLAG","v":{"$error":"#N/A"}},null,{"$f":"IF(E$9=\"NSWL\",LOOKUP(C19, Boats!$A$3:E$53,Boats!H$3:H$53),(IF(E$9=\"WL\",LOOKUP(C19, Boats!$A$3:E$53,Boats!F$3:F$53),(IF(E$9=\"NSCR\",LOOKUP(C19, Boats!$A$3:E$53,Boats!I$3:I$53))))))","v":{"$error":"#N/A"}},23,0,0,35700,35700,9,55,0,null,{"$error":"#N/A"},{"$error":"#N/A"},{"$error":"#N/A"},{"$error":"#N/A"},{"$error":"#N/A"},{"$error":"#N/A"}]
[8,{"$f":"LOOKUP(C20, Boats!$A$3:B$53,Boats!B$3:B$53)&NSFLAG","v":{"$error":"#N/A"}},null,{"$f":"IF(E$9=\"NSWL\",LOOKUP(C20, Boats!$A$3:E$53,Boats!H$3:H$53),(IF(E$9=\"WL\",LOOKUP(C20, Boats!$A$3:E$53,Boats!F$3:F$53),(IF(E$9=\"NSCR\",LOOKUP(C20, Boats!$A$3:E$53,Boats!I$3:I$53))))))","v":{"$error":"#N/A"}},23,0,0,35700,35700,9,55,0,null,{"$error":"#N/A"},{"$error":"#N/A"},{"$error":"#N/A"},{"$error":"#N/A"},{"$error":"#N/A"},{"$error":"#N/A"}]
{"$rows_left_out":9}
{"sheet":"Race Spin","index":2,"n_rows":28,"n_cols":20,"rows_kept":28,"cut":false,"hidden":false,"merged":[[5,1,5,3],[2,3,2,7],[3,3,3,5],[4,3,4,19],[6,2,6,3],[7,2,7,3],[7,4,7,5],[9,9,9,11],[9,14,9,18],[10,4,10,6],[10,9,10,11],[10,14,10,18]]}
[]
["   Race Name :  --->",null,null,{"$f":"'Race NS'!D2","v":"Frostbite Series - Fall # "}]
["  Committee Boat Name -->  ",null,null,{"$f":"'Race NS'!D3:H3","v":"Cheetah"}]
[null," Date  -->",null,{"$f":"'Race NS'!D4:F4","v":"2019-08-14"}]
[null," Conditions --> (optional)",null,{"$f":"'Race NS'!D5:T5","v":"GOOD"}]
[null,"Spin  - Start     =    ",null,null,13,10,0]
[null,null,"  Course   =      ",null,"Y",null,null,null,null,null,null,null,null,null,"Leave course blank if the same as prior section start"]
[null,null,"  Distance  =   ",null,{"$f":"IF(ISBLANK(F7),'Race NS'!$E$8, VLOOKUP( E7,Course!$A$23:$T$41, LOOKUP(F7,Course!$A$2:$A$19,Course!$B$2:$B$19),FALSE))+IF(ISBLANK(G7), 0, VLOOKUP(F7,Course!$A$23:$T$41, LOOKUP(G7,Course!$A$2:$A$19,Course!$B$2:$B$19),FALSE))+IF(ISBLANK(J7), 0, VLOOKUP(G7,Course!$A$23:$T$41, LOOKUP(J7,Course!$A$2:$A$19,Course!$B$2:$B$19),FALSE))+IF(ISBLANK(K7), 0, VLOOKUP(J7,Course!$A$23:$T$41, LOOKUP(K7,Course!$A$2:$A$19,Course!$B$2:$B$19),FALSE))+IF(ISBLANK(L7), 0, VLOOKUP(K7,Course!$A$23:$T$41, LOOKUP(L7,Course!$A$2:$A$19,Course!$B$2:$B$19),FALSE))+IF(ISBLANK(M7), 0, VLOOKUP(L7,Course!$A$23:$T$41, LOOKUP(M7,Course!$A$2:$A$19,Course!$B$2:$B$19),FALSE))","v":3.58}]
[null,null,"PHRF Type =  ",null,"WL"]
[null,null,null,null,null,null,null,null,null,"Uncorrected",null,null,null,"PHRF","Corrected"]
[null,"Sail","Yacht","PHRF","Finish Time",null,null,null,null,"Elapsed Time",null,null,null,"Allowance","Time",null,null,null,null,"Remarks"]
[null,"Number","Name","Rating","(hr)","(min)","(sec)",null,null,"(hr)","(min)","(sec)",null,"(Sec)","(Total Sec)",null,"(hr)","(min)","(sec)","(DNS/DNF)"]
[1,{"$f":"LOOKUP(C13, Boats!$A$3:B$53,Boats!B$3:B$53)","v":{"$error":"#N/A"}},null,{"$f":"IF(E$9=\"NS\",LOOKUP(C13, Boats!$A$3:E$53,Boats!I$3:I$53),(IF(E$9=\"WL\",LOOKUP(C13, Boats!$A$3:E$53,Boats!F$3:F$53),(IF(E$9=\"CR\",LOOKUP(C13, Boats!$A$3:E$53,Boats!G$3:G$53))))))","v":{"$error":"#N/A"}},23,0,0,{"$f":"((E13*60*60+F13*60+G13)-(E$6*60*60+F$6*60+G$6))","v":35400},{"$f":"J13*60*60+K13*60","v":35400},{"$f":"ROUNDDOWN(H13/60/60, 0)","v":9},{"$f":"ROUNDDOWN((H13 - (J13*60*60))/60, 0)","v":50},{"$f":"H13-I13","v":0},null,{"$f":"D13*$E$8","v":{"$error":"#N/A"}},{"$f":"((J13*60+K13)*60+L13)-N13","v":{"$error":"#N/A"}},{"$f":"Q13*60*60+R13*60","v":{"$error":"#N/A"}},{"$f":"ROUNDDOWN(O13/60/60, 0)","v":{"$error":"#N/A"}},{"$f":"ROUNDDOWN((O13 - (Q13*60*60))/60, 0)","v":{"$error":"#N/A"}},{"$f":"O13-P13","v":{"$error":"#N/A"}}]
[2,{"$f":"LOOKUP(C14, Boats!$A$3:B$53,Boats!B$3:B$53)","v":{"$error":"#N/A"}},null,{"$f":"IF(E$9=\"NS\",LOOKUP(C14, Boats!$A$3:E$53,Boats!I$3:I$53),(IF(E$9=\"WL\",LOOKUP(C14, Boats!$A$3:E$53,Boats!F$3:F$53),(IF(E$9=\"CR\",LOOKUP(C14, Boats!$A$3:E$53,Boats!G$3:G$53))))))","v":{"$error":"#N/A"}},23,0,0,35400,35400,9,50,0,null,{"$error":"#N/A"},{"$error":"#N/A"},{"$error":"#N/A"},{"$error":"#N/A"},{"$error":"#N/A"},{"$error":"#N/A"}]
[3,{"$f":"LOOKUP(C15, Boats!$A$3:B$53,Boats!B$3:B$53)","v":{"$error":"#N/A"}},null,{"$f":"IF(E$9=\"NS\",LOOKUP(C15, Boats!$A$3:E$53,Boats!I$3:I$53),(IF(E$9=\"WL\",LOOKUP(C15, Boats!$A$3:E$53,Boats!F$3:F$53),(IF(E$9=\"CR\",LOOKUP(C15, Boats!$A$3:E$53,Boats!G$3:G$53))))))","v":{"$error":"#N/A"}},23,0,0,35400,35400,9,50,0,null,{"$error":"#N/A"},{"$error":"#N/A"},{"$error":"#N/A"},{"$error":"#N/A"},{"$error":"#N/A"},{"$error":"#N/A"}]
[4,{"$f":"LOOKUP(C16, Boats!$A$3:B$53,Boats!B$3:B$53)","v":{"$error":"#N/A"}},null,{"$f":"IF(E$9=\"NS\",LOOKUP(C16, Boats!$A$3:E$53,Boats!I$3:I$53),(IF(E$9=\"WL\",LOOKUP(C16, Boats!$A$3:E$53,Boats!F$3:F$53),(IF(E$9=\"CR\",LOOKUP(C16, Boats!$A$3:E$53,Boats!G$3:G$53))))))","v":{"$error":"#N/A"}},23,0,0,35400,35400,9,50,0,null,{"$error":"#N/A"},{"$error":"#N/A"},{"$error":"#N/A"},{"$error":"#N/A"},{"$error":"#N/A"},{"$error":"#N/A"}]
[5,{"$f":"LOOKUP(C17, Boats!$A$3:B$53,Boats!B$3:B$53)","v":{"$error":"#N/A"}},null,{"$f":"IF(E$9=\"NS\",LOOKUP(C17, Boats!$A$3:E$53,Boats!I$3:I$53),(IF(E$9=\"WL\",LOOKUP(C17, Boats!$A$3:E$53,Boats!F$3:F$53),(IF(E$9=\"CR\",LOOKUP(C17, Boats!$A$3:E$53,Boats!G$3:G$53))))))","v":{"$error":"#N/A"}},23,0,0,35400,35400,9,50,0,null,{"$error":"#N/A"},{"$error":"#N/A"},{"$error":"#N/A"},{"$error":"#N/A"},{"$error":"#N/A"},{"$error":"#N/A"}]
[6,{"$f":"LOOKUP(C18, Boats!$A$3:B$53,Boats!B$3:B$53)","v":{"$error":"#N/A"}},null,{"$f":"IF(E$9=\"NS\",LOOKUP(C18, Boats!$A$3:E$53,Boats!I$3:I$53),(IF(E$9=\"WL\",LOOKUP(C18, Boats!$A$3:E$53,Boats!F$3:F$53),(IF(E$9=\"CR\",LOOKUP(C18, Boats!$A$3:E$53,Boats!G$3:G$53))))))","v":{"$error":"#N/A"}},23,0,0,35400,35400,9,50,0,null,{"$error":"#N/A"},{"$error":"#N/A"},{"$error":"#N/A"},{"$error":"#N/A"},{"$error":"#N/A"},{"$error":"#N/A"}]
[7,{"$f":"LOOKUP(C19, Boats!$A$3:B$53,Boats!B$3:B$53)","v":{"$error":"#N/A"}},null,{"$f":"IF(E$9=\"NS\",LOOKUP(C19, Boats!$A$3:E$53,Boats!I$3:I$53),(IF(E$9=\"WL\",LOOKUP(C19, Boats!$A$3:E$53,Boats!F$3:F$53),(IF(E$9=\"CR\",LOOKUP(C19, Boats!$A$3:E$53,Boats!G$3:G$53))))))","v":{"$error":"#N/A"}},23,0,0,35400,35400,9,50,0,null,{"$error":"#N/A"},{"$error":"#N/A"},{"$error":"#N/A"},{"$error":"#N/A"},{"$error":"#N/A"},{"$error":"#N/A"}]
[8,{"$f":"LOOKUP(C20, Boats!$A$3:B$53,Boats!B$3:B$53)","v":{"$error":"#N/A"}},null,{"$f":"IF(E$9=\"NS\",LOOKUP(C20, Boats!$A$3:E$53,Boats!I$3:I$53),(IF(E$9=\"WL\",LOOKUP(C20, Boats!$A$3:E$53,Boats!F$3:F$53),(IF(E$9=\"CR\",LOOKUP(C20, Boats!$A$3:E$53,Boats!G$3:G$53))))))","v":{"$error":"#N/A"}},23,0,0,35400,35400,9,50,0,null,{"$error":"#N/A"},{"$error":"#N/A"},{"$error":"#N/A"},{"$error":"#N/A"},{"$error":"#N/A"},{"$error":"#N/A"}]
{"$rows_left_out":9}
{"sheet":"Boats","index":3,"n_rows":109,"n_cols":23,"rows_kept":109,"cut":false,"hidden":false,"merged":[[0,5,0,8]]}
[null,"N",null,null,null,"PHRF"]
["Boat","SailNo","Owner","Valid List 2019","email","Spin - WL","Spin - CR","NonSpin-WL","NonSpin-CR","Race Fee","Spinclass","I","J","P","E","LOA","LWL","Disp","UpSAD","DWSAD","DLWL"]
[null,null,null,null,null,null,null,null,null,null,null,null,null,null,null,null,null,null,null,null,null,{"$f":"SUM(V4:V46)","v":21}]
["American Flyer",39519,"Dan Schneider","Y","dc_schneider@msn.com",36,33,42,42,"yes","A",51.25,14.04,50.45,18.47,39.4,34.119999999999997,13000,29.96,63.34,146.10607247052599,null,"American Flyer"]
["Arctic Tern",93642,"PAX","Y",null,168,168,168,168,"no","C",null,null,null,null,null,null,null,null,null,null,1]
["Bad Cat","063","Jim Whited","Y","jimw625@comcast.net",39,33,48,48,"yes","A",48.36,13.84,45.17,45.17,36.5,32.700000000000003,9300,23.92,70.47,118.74,1]
["Badger",144,"Carl Feusaherns","Y","feus@comcast.net",177,177,177,177,"yes","C",30.5,9.5,29.42,12.29,25.9,21.7,4250,19.829999999999998,41.94,185.68,1]
["Barba Roja",73052,"Stephen Birchfield","Y",null,165,165,165,165,"yes","C"]
["Blue Boat Home",4856,"Lowell Martin","Y",null,231,231,231,231,"no","C",34,11.25,28.67,10.5,26.8,21.8,6850,15.14,35.43,295.17,1]
["Blue Goose",93643,"PAX","N",null,168,168,168,168,"no","C"]
["C 2 (squared)",720,"Chris Staley","Y",null,189,189,189,189,"yes","C"]
["Cheetah",50473,"Marc Briere","Y","race@smsa.com",48,39,57,57,"yes","A",43.7,12.6,44.7,16.5,35.86,31.76,8150,25.41,73.319999999999993,113.14,1]
["Elan",43162,"Gary Shaw","Y","garyshaw75@aol.com",156,156,156,156,"no","C",49.5,15.33,42,11,36.83,29.5,13500,18.71,39.33,234.75762231915499,1]
["Flyer",25126,"Michael Major","N","mjamesmajor@gmail.com",111,111,114,114,"no","B",40.18,11.65,42.27,15.79,34.4,27.2,8825,21.24,39.65,195.78]
["Hellcat",52994,"Jim Keen","Y",null,96,99,102,105,"yes"]
["J Ray","USA47","Larry Ray","Y","mlray@gmail.com",114,111,120,120,"yes","B",26.77,7.68,26.16,9.44,22.8,20.5,1750,29.6,43,90.68,1]
["Juggernaut",51277,"David Ahearn","N",null,39,39,39,39,"no","A",50.82,14.7,51.75,16.5,37.700000000000003,34.200000000000003,11400,25.24,71.02,127.23]
["Krugerrand",53477,"Sarah Southworth","N","write2ss@cs.com",132,132,132,132,"no","B",48.42,14.33,42.33,13,36.17,29.42,15300,17.77,35.47,{"$f":"((R18/(2240*POWER((Q18/100),3))))","v":268.2349766677014},1]
["Lakahi",25260,"Jim Young","N","youngjw1203@earthlink.net",72,72,72,72,"yes","A",48,14.25,47,14.58,35.42,30,9800,26.64,50.21,162.03703703703701]
["Lickety Split",43067,"Donna Maneely","Y","damaneely@verizon.net",168,168,168,168,"no","C",40.86,13,35.36,11.79,31.71,25,9400,18.73,33.700000000000003,268.57142857142901,1]
{"$rows_left_out":90}
{"sheet":"ScoreSheet","index":4,"n_rows":45,"n_cols":14,"rows_kept":45,"cut":false,"hidden":false,"merged":[[0,0,0,3],[2,2,2,4],[0,4,0,10]]}
["SMSA Scoring Worksheet",null,null,null,"Race Name _________________________________"]
[null,"Date : ","_____________________",null,null,"RC: ",null,"____________________"]
[null,"Course: ","_______________________________________",null,null,null,null,null,null,null,null,"Finish time"]
["Boat","SailNo","Owner","Spin","NonSpin","Race Fee","PHRF Cert","Spinclass","Checked In","Start Class ","(hr)","(min)","(sec)","Notes"]
[" "," "," "," "," "," ",null," "]
[{"$f":"Boats!A4","v":"American Flyer"},{"$f":"Boats!B4","v":39519},{"$f":"Boats!C4","v":"Dan Schneider"},{"$f":"Boats!F4","v":36},{"$f":"Boats!I4","v":42},{"$f":"Boats!J4","v":"yes"},{"$f":"Boats!D4","v":"Y"},{"$f":"Boats!K4","v":"A"}]
[{"$f":"Boats!A5","v":"Arctic Tern"},{"$f":"Boats!B5","v":93642},{"$f":"Boats!C5","v":"PAX"},{"$f":"Boats!F5","v":168},{"$f":"Boats!I5","v":168},{"$f":"Boats!J5","v":"no"},{"$f":"Boats!D5","v":"Y"},{"$f":"Boats!K5","v":"C"}]
[{"$f":"Boats!A6","v":"Bad Cat"},{"$f":"Boats!B6","v":"063"},{"$f":"Boats!C6","v":"Jim Whited"},{"$f":"Boats!F6","v":39},{"$f":"Boats!I6","v":48},{"$f":"Boats!J6","v":"yes"},{"$f":"Boats!D6","v":"Y"},{"$f":"Boats!K6","v":"A"}]
[{"$f":"Boats!A7","v":"Badger"},{"$f":"Boats!B7","v":144},{"$f":"Boats!C7","v":"Carl Feusaherns"},{"$f":"Boats!F7","v":177},{"$f":"Boats!I7","v":177},{"$f":"Boats!J7","v":"yes"},{"$f":"Boats!D7","v":"Y"},{"$f":"Boats!K7","v":"C"}]
[{"$f":"Boats!A8","v":"Barba Roja"},{"$f":"Boats!B8","v":73052},{"$f":"Boats!C8","v":"Stephen Birchfield"},{"$f":"Boats!F8","v":165},{"$f":"Boats!I8","v":165},{"$f":"Boats!J8","v":"yes"},{"$f":"Boats!D8","v":"Y"},{"$f":"Boats!K8","v":"C"}]
[{"$f":"Boats!A9","v":"Blue Boat Home"},{"$f":"Boats!B9","v":4856},{"$f":"Boats!C9","v":"Lowell Martin"},{"$f":"Boats!F9","v":231},{"$f":"Boats!I9","v":231},{"$f":"Boats!J9","v":"no"},{"$f":"Boats!D9","v":"Y"},{"$f":"Boats!K9","v":"C"}]
[{"$f":"Boats!A10","v":"Blue Goose"},{"$f":"Boats!B10","v":93643},{"$f":"Boats!C10","v":"PAX"},{"$f":"Boats!F10","v":168},{"$f":"Boats!I10","v":168},{"$f":"Boats!J10","v":"no"},{"$f":"Boats!D10","v":"N"},{"$f":"Boats!K10","v":"C"}]
[{"$f":"Boats!A11","v":"C 2 (squared)"},{"$f":"Boats!B11","v":720},{"$f":"Boats!C11","v":"Chris Staley"},{"$f":"Boats!F11","v":189},{"$f":"Boats!I11","v":189},{"$f":"Boats!J11","v":"yes"},{"$f":"Boats!D11","v":"Y"},{"$f":"Boats!K11","v":"C"}]
[{"$f":"Boats!A12","v":"Cheetah"},{"$f":"Boats!B12","v":50473},{"$f":"Boats!C12","v":"Marc Briere"},{"$f":"Boats!F12","v":48},{"$f":"Boats!I12","v":57},{"$f":"Boats!J12","v":"yes"},{"$f":"Boats!D12","v":"Y"},{"$f":"Boats!K12","v":"A"}]
[{"$f":"Boats!A13","v":"Elan"},{"$f":"Boats!B13","v":43162},{"$f":"Boats!C13","v":"Gary Shaw"},{"$f":"Boats!F13","v":156},{"$f":"Boats!I13","v":156},{"$f":"Boats!J13","v":"no"},{"$f":"Boats!D13","v":"Y"},{"$f":"Boats!K13","v":"C"}]
[{"$f":"Boats!A14","v":"Flyer"},{"$f":"Boats!B14","v":25126},{"$f":"Boats!C14","v":"Michael Major"},{"$f":"Boats!F14","v":111},{"$f":"Boats!I14","v":114},{"$f":"Boats!J14","v":"no"},{"$f":"Boats!D14","v":"N"},{"$f":"Boats!K14","v":"B"}]
[{"$f":"Boats!A16","v":"J Ray"},{"$f":"Boats!B16","v":"USA47"},{"$f":"Boats!C16","v":"Larry Ray"},{"$f":"Boats!F16","v":114},{"$f":"Boats!I16","v":120},{"$f":"Boats!J16","v":"yes"},{"$f":"Boats!D15","v":"Y"},{"$f":"Boats!K16","v":"B"}]
[{"$f":"Boats!A17","v":"Juggernaut"},{"$f":"Boats!B17","v":51277},{"$f":"Boats!C17","v":"David Ahearn"},{"$f":"Boats!F17","v":39},{"$f":"Boats!I17","v":39},{"$f":"Boats!J17","v":"no"},{"$f":"Boats!D16","v":"Y"},{"$f":"Boats!K17","v":"A"}]
[{"$f":"Boats!A18","v":"Krugerrand"},{"$f":"Boats!B18","v":53477},{"$f":"Boats!C18","v":"Sarah Southworth"},{"$f":"Boats!F18","v":132},{"$f":"Boats!I18","v":132},{"$f":"Boats!J18","v":"no"},{"$f":"Boats!D17","v":"N"},{"$f":"Boats!K18","v":"B"}]
[{"$f":"Boats!A20","v":"Lickety Split"},{"$f":"Boats!B20","v":43067},{"$f":"Boats!C20","v":"Donna Maneely"},{"$f":"Boats!F20","v":168},{"$f":"Boats!I20","v":168},{"$f":"Boats!J20","v":"no"},{"$f":"Boats!D18","v":"N"},{"$f":"Boats!K20","v":"C"}]
{"$rows_left_out":26}
{"sheet":"RSinput","index":5,"n_rows":20,"n_cols":8,"rows_kept":20,"cut":false,"hidden":false,"merged":[]}
["Sail","BoatName","PHRF",null,null,null,"Finish","Division"]
["93084-X","Maverick",24,19,21,4,{"$f":"TIME(D2,E2,F2)","v":"19:21:04"},"PHRF A"]
[63243,"Natural Disaster",114,19,24,41,"19:24:41","PHRF B"]
[71221,"Short Bus",45,19,25,2,"19:25:02","PHRF A"]
[43067,"Lickety Split",168,19,28,27,"19:28:27","PHRF C"]
[50473,"Cheetah",42,19,28,30,"19:28:30","PHRF A"]
[43162,"Elan",156,19,29,27,"19:29:27","PHRF C"]
[63383,"Stingray",129,19,29,55,"19:29:55","PHRF B"]
["USA333","Splash",90,19,30,17,"19:30:17","PHRF A"]
["USA335","Rakali",90,19,30,34,"19:30:34","PHRF A"]
[63199,"The Doghouse",111,19,31,29,"19:31:29","PHRF B"]
["063","Bad Cat",39,19,31,36,"19:31:36","PHRF A"]
[144,"Badger",177,19,32,51,"19:32:51","PHRF C"]
[93121,"Wicked Good",132,19,32,54,"19:32:54","PHRF B"]
["USA47","J Ray",114,19,33,5,"19:33:05","PHRF B"]
[52994,"Hellcat",96,19,34,12,"19:34:12","PHRF B"]
[52994,"Hellcat",96,19,34,12,"19:34:12","PHRF A"]
["73211N","Whirlaway",114,19,36,24,"19:36:24","NonSpin"]
["93643N","Blue Goose",168,19,47,45,"19:47:45","NonSpin"]
["4856N","Blue Boat Home",231,20,0,0,"20:00:00","NonSpin"]
{"$rows_left_out":1}
{"sheet":"Course","index":6,"n_rows":50,"n_cols":20,"rows_kept":50,"cut":false,"hidden":false,"merged":[]}
[null,20,20,null,null,null,20,20,null,null,20,20]
[null,20,20,null,null,"A",2,2,null,"A",2,2,null,"Page has been customized for Wednesday night MARKS"]
["A",2,2,null,null,"B",3,3,null,"B",3,3]
["B",3,3,null,null,"C",4,4,null,"E",5,5]
["E",5,5,null,null,"E",5,5,null,"K",10,10]
["K",10,10,null,null,"G",6,6,null,"L",11,11]
["L",11,11,null,null,"H",7,7,null,"M",12,12]
["M",12,12,null,null,"I",8,8,null,"S",17,17]
["S",17,17,null,null,"J",9,9,null,"T",14,14]
["T",14,14,null,null,"K",10,10,null,"X",16,16]
["V",16,16,null,null,"L",11,11,null,"Y",18,18]
["X",20,20,null,null,"M",12,12,null,"Z",19,19]
["Y",18,18,null,null,"S",17,17]
["Z",19,19,null,null,"T",14,14]
[null,null,null,null,null,"V",16,16]
[null,null,null,null,null,"X",16,16]
[null,null,null,null,null,"Y",18,18]
[null,null,null,null,null,"Z",19,19]
[null,"Active",null,null,null,null,"All",null,null,null,"Bay"]
[]
{"$rows_left_out":30}